Target
Serine/threonine-protein kinase PAK 1
Ligand
BDBM50434332
Substrate
Meas. Tech.
ChEMBL_960989 (CHEMBL2388905)
IC50
133±n/a nM
Citation
 Abdel-Magid, AF PAK1: A Therapeutic Target for Cancer Treatment. ACS Med Chem Lett 4:431-2 (2013)  
Target
Name:
Serine/threonine-protein kinase PAK 1
Synonyms:
2.7.11.1 Cell division control protein 42 homolog PAK-1 PAK1_HUMAN p21-activated kinase 1 | p65-PAK
Type:
Mol. Mass.:
60640.15
Organism:
Homo sapiens (Human)
Description:
Q13153
Residue:
545
  
Inhibitor
Name:
BDBM50434332
Synonyms:
CHEMBL2386716
Type:
Small organic molecule
Emp. Form.:
C21H23N7
Mol. Mass.:
373.4542
SMILES:
C[C@H](Nc1nccc(Nc2cc(n[nH]2)C2CCC2)n1)c1ccc2[nH]ccc2c1
: