Target
Dual specificity tyrosine-phosphorylation-regulated kinase 1A
Ligand
BDBM50434347
Substrate
Meas. Tech.
ChEMBL_961005 (CHEMBL2388921)
IC50
1.7±n/a nM
Citation
 Rosse, G Tricyclic Pyrimidines As Inhibitors of DYRK1A/DYRK1B As Potential Treatment for Down's Syndrome or Alzheimer's Disease. ACS Med Chem Lett 4:502-3 (2013)  
Target
Name:
Dual specificity tyrosine-phosphorylation-regulated kinase 1A
Synonyms:
DYR1A_HUMAN DYRK1A Dual specificity YAK1-related kinase 1A (Dyrk1A) Dual-specificity tyrosine-phosphorylation regulated kinase 1A HP86 MNBH
Type:
Enzyme
Mol. Mass.:
85616.61
Organism:
Homo sapiens (Human)
Description:
Q13627
Residue:
763
  
Inhibitor
Name:
BDBM50434347
Synonyms:
CHEMBL2386753 | US9446044, 48
Type:
Small organic molecule
Emp. Form.:
C18H13N5O3S
Mol. Mass.:
379.393
SMILES:
COC(=N)c1nc2ccc3ncnc(Nc4ccc5OCOc5c4)c3c2s1
: