Target
Renin
Ligand
BDBM50434421
Substrate
Meas. Tech.
ChEMBL_962066 (CHEMBL2388034)
IC50
1.3±n/a nM
Citation
 Nakamura, YFujimoto, TOgawa, YNamiki, HSuzuki, SAsano, MSugita, CMochizuki, AMiyazaki, STamaki, KNagai, YInoue, SNagayama, TKato, MChiba, KTakasuna, KNishi, T Lead optimization of 5-amino-6-(2,2-dimethyl-5-oxo-4-phenylpiperazin-1-yl)-4-hydroxyhexanamides to reduce a cardiac safety issue: discovery of DS-8108b, an orally active renin inhibitor. Bioorg Med Chem 21:3175-96 (2013)  
Target
Name:
Renin
Synonyms:
Angiotensinogenase RENI_HUMAN
Type:
Enzyme
Mol. Mass.:
45058.99
Organism:
Homo sapiens (Human)
Description:
Residue:
406
  
Inhibitor
Name:
BDBM50434421
Synonyms:
CHEMBL2387571
Type:
Small organic molecule
Emp. Form.:
C31H46ClN5O4
Mol. Mass.:
588.181
SMILES:
CC[C@H](C[C@H](O)[C@@H](N)CN1CC(=O)N(CC1(C)C)c1ccccc1Cl)C(=O)NC1C2CC3CC1CC(C3)(C2)C(N)=O
: