Target
Bone morphogenetic protein receptor type-1B
Ligand
BDBM50261979
Substrate
Meas. Tech.
ChEMBL_961931 (CHEMBL2390522)
IC50
9830±n/a nM
Citation
 Engers, DWFrist, AYLindsley, CWHong, CCHopkins, CR Synthesis and structure-activity relationships of a novel and selective bone morphogenetic protein receptor (BMP) inhibitor derived from the pyrazolo[1.5-a]pyrimidine scaffold of dorsomorphin: the discovery of ML347 as an ALK2 versus ALK3 selective MLPCN probe. Bioorg Med Chem Lett 23:3248-52 (2013)  
Target
Name:
Bone morphogenetic protein receptor type-1B
Synonyms:
ALK-6 BMPR1B Bone morphogenetic protein receptor type-1B (BMPR1B)
Type:
Enzyme
Mol. Mass.:
56939.41
Organism:
Homo sapiens (Human)
Description:
O00238
Residue:
502
  
Inhibitor
Name:
BDBM50261979
Synonyms:
5-(6-(4-methoxyphenyl)pyrazolo[1,5-a]pyrimidin-3-yl)quinoline | CHEMBL502351
Type:
Small organic molecule
Emp. Form.:
C22H16N4O
Mol. Mass.:
352.3886
SMILES:
COc1ccc(cc1)-c1cnc2c(cnn2c1)-c1cccc2ncccc12
: