Target
Activin receptor type-1B
Ligand
BDBM50434751
Substrate
Meas. Tech.
ChEMBL_961932 (CHEMBL2390523)
IC50
5930±n/a nM
Citation
 Engers, DWFrist, AYLindsley, CWHong, CCHopkins, CR Synthesis and structure-activity relationships of a novel and selective bone morphogenetic protein receptor (BMP) inhibitor derived from the pyrazolo[1.5-a]pyrimidine scaffold of dorsomorphin: the discovery of ML347 as an ALK2 versus ALK3 selective MLPCN probe. Bioorg Med Chem Lett 23:3248-52 (2013)  
Target
Name:
Activin receptor type-1B
Synonyms:
ACV1B_HUMAN ACVRLK4 Activin receptor type-1B/Activin receptor-like kinase 4 (ALK-4)
Type:
PROTEIN
Mol. Mass.:
56810.99
Organism:
Homo sapiens (Human)
Description:
ChEMBL_587064
Residue:
505
  
Inhibitor
Name:
BDBM50434751
Synonyms:
CHEMBL2385579
Type:
Small organic molecule
Emp. Form.:
C19H18N6O
Mol. Mass.:
346.3858
SMILES:
C1CN(CCO1)c1ccc(cc1)-c1cnc2c(cnn2c1)-c1cn[nH]c1
: