Target
Thymidylate synthase
Ligand
BDBM18795
Substrate
Meas. Tech.
ChEMBL_962697 (CHEMBL2388424)
IC50
260±n/a nM
Citation
 Cao, SLHan, YYuan, CZWang, YXiahou, ZKLiao, JGao, RTMao, BBZhao, BLLi, ZFXu, X Synthesis and antiproliferative activity of 4-substituted-piperazine-1-carbodithioate derivatives of 2,4-diaminoquinazoline. Eur J Med Chem 64:401-9 (2013)  
Target
Name:
Thymidylate synthase
Synonyms:
TS TYMS Thymidylate synthase (TS) | Thymidylate synthase/GAR transformylase/AICAR transformylase
Type:
Enzyme
Mol. Mass.:
35718.07
Organism:
Homo sapiens (Human)
Description:
Residue:
313
  
Inhibitor
Name:
BDBM18795
Synonyms:
(2S)-2-[(5-{methyl[(2-methyl-4-oxo-1,4-dihydroquinazolin-6-yl)methyl]amino}thiophen-2-yl)formamido]pentanedioic acid RTX Tomudex | ZD1694
Type:
Small organic molecule
Emp. Form.:
C21H22N4O6S
Mol. Mass.:
458.488
SMILES:
CN(Cc1ccc2nc(C)[nH]c(=O)c2c1)c1ccc(s1)C(=O)N[C@@H](CCC(O)=O)C(O)=O
: