Target
Casein kinase I isoform epsilon
Ligand
BDBM50435022
Substrate
Meas. Tech.
ChEMBL_964507 (CHEMBL2393652)
IC50
>100000±n/a nM
Citation
 Lo Monte, FKramer, TGu, JBrodrecht, MPilakowski, JFuertes, ADominguez, JMPlotkin, BEldar-Finkelman, HSchmidt, B Structure-based optimization of oxadiazole-based GSK-3 inhibitors. Eur J Med Chem 61:26-40 (2013)  
Target
Name:
Casein kinase I isoform epsilon
Synonyms:
Axin-1/Casein kinase I epsilon CKIe Casein kinase 1 epsilon (CK1Ɛ) Casein kinase I isoform epsilon (CK1 epsilon) Casein kinase I isoform epsilon (CK1epsilon) | KC1E_HUMAN
Type:
Protein
Mol. Mass.:
47340.25
Organism:
Homo sapiens (Human)
Description:
P49674
Residue:
416
  
Inhibitor
Name:
BDBM50435022
Synonyms:
CHEMBL2391130
Type:
Small organic molecule
Emp. Form.:
C24H17N3O3S
Mol. Mass.:
427.475
SMILES:
N#Cc1cccc(c1)-c1ccc(CSc2nnc(o2)-c2ccc3OCCOc3c2)cc1
: