Target
Cyclin-dependent kinase 5
Ligand
BDBM50435031
Substrate
Meas. Tech.
ChEMBL_964508 (CHEMBL2393653)
IC50
>100000±n/a nM
Citation
 Lo Monte, FKramer, TGu, JBrodrecht, MPilakowski, JFuertes, ADominguez, JMPlotkin, BEldar-Finkelman, HSchmidt, B Structure-based optimization of oxadiazole-based GSK-3 inhibitors. Eur J Med Chem 61:26-40 (2013)  
Target
Name:
Cyclin-dependent kinase 5
Synonyms:
CDK5 CDKN5 Cyclin-dependent kinase 5 (CDK5/ p25) Cyclin-dependent-like kinase 5 PSSALRE Tau protein kinase II catalytic subunit
Type:
Enzyme Subunit
Mol. Mass.:
33308.61
Organism:
Homo sapiens (Human)
Description:
Residue:
292
  
Inhibitor
Name:
BDBM50435031
Synonyms:
CHEMBL2391132
Type:
Small organic molecule
Emp. Form.:
C21H14N4OS
Mol. Mass.:
370.427
SMILES:
N#Cc1cccc(c1)-c1ccc(CSc2nnc(o2)-c2ccncc2)cc1
: