Target
Aurora kinase A
Ligand
BDBM50435038
Substrate
Meas. Tech.
ChEMBL_964506 (CHEMBL2393651)
IC50
>100000±n/a nM
Citation
 Lo Monte, FKramer, TGu, JBrodrecht, MPilakowski, JFuertes, ADominguez, JMPlotkin, BEldar-Finkelman, HSchmidt, B Structure-based optimization of oxadiazole-based GSK-3 inhibitors. Eur J Med Chem 61:26-40 (2013)  
Target
Name:
Aurora kinase A
Synonyms:
AIK ARK1 AURKA AYK1 Aurora kinase A (AURA) Aurora kinase A (Aurora A) Aurora-related kinase 1 BTAK Breast-tumor-amplified kinase STK15 Serine/threonine kinase 15 Serine/threonine-protein kinase aurora A hARK1
Type:
Serine/threonine-protein kinase
Mol. Mass.:
45830.98
Organism:
Homo sapiens (Human)
Description:
O14965
Residue:
403
  
Inhibitor
Name:
BDBM50435038
Synonyms:
CHEMBL2391117
Type:
Small organic molecule
Emp. Form.:
C22H14F2N2O3S
Mol. Mass.:
424.42
SMILES:
Fc1cc(F)cc(c1)-c1ccc(CSc2nnc(o2)-c2ccc3OCOc3c2)cc1
: