Target
5-hydroxytryptamine receptor 3A
Ligand
BDBM82561
Substrate
Meas. Tech.
ChEMBL_965430 (CHEMBL2395076)
IC50
11±n/a nM
Citation
 Germain, ARCarmody, LCNag, PPMorgan, BVerplank, LFernandez, CDonckele, EFeng, YPerez, JRDandapani, SPalmer, MLander, ESGupta, PBSchreiber, SLMunoz, B Cinnamides as selective small-molecule inhibitors of a cellular model of breast cancer stem cells. Bioorg Med Chem Lett 23:1834-8 (2013)  
Target
Name:
5-hydroxytryptamine receptor 3A
Synonyms:
5-HT-3 5-HT3A 5-hydroxytryptamine receptor 3 (5-HT3) 5-hydroxytryptamine receptor 3A (5HT3A) 5HT3R HTR3A Serotonin 3 receptor (5HT3) Serotonin-gated ion channel receptor | Serotonin-gated ion channel receptor 3
Type:
Protein
Mol. Mass.:
55283.27
Organism:
Homo sapiens (Human)
Description:
P46098
Residue:
478
  
Inhibitor
Name:
BDBM82561
Synonyms:
CAS_40796-97-2 Tropanyl-3,5 dichlorobenzoate
Type:
Small organic molecule
Emp. Form.:
C15H17Cl2NO2
Mol. Mass.:
314.207
SMILES:
CN1[C@H]2CC[C@@H]1C[C@@H](C2)OC(=O)c1cc(Cl)cc(Cl)c1
: