Target
B1 bradykinin receptor
Ligand
BDBM50156454
Substrate
Meas. Tech.
ChEMBL_965477 (CHEMBL2395281)
IC50
0.870000±n/a nM
Citation
 Germain, ARCarmody, LCNag, PPMorgan, BVerplank, LFernandez, CDonckele, EFeng, YPerez, JRDandapani, SPalmer, MLander, ESGupta, PBSchreiber, SLMunoz, B Cinnamides as selective small-molecule inhibitors of a cellular model of breast cancer stem cells. Bioorg Med Chem Lett 23:1834-8 (2013)  
Target
Name:
B1 bradykinin receptor
Synonyms:
B1 BRADYKININ B1R BK-1 receptor BRADYB1 | Bradykinin B1 receptor
Type:
Enzyme
Mol. Mass.:
40508.87
Organism:
Homo sapiens (Human)
Description:
P46663
Residue:
353
  
Inhibitor
Name:
BDBM50156454
Synonyms:
CHEMBL264100 | des-Arg10-Kallidin
Type:
Small organic molecule
Emp. Form.:
C50H73N13O11
Mol. Mass.:
1032.1951
SMILES:
NCCCC[C@H](N)C(=O)N[C@@H](CCCNC(N)=N)C(=O)N1CCC[C@H]1C(=O)N1CCC[C@H]1C(=O)NCC(=O)N[C@@H](Cc1ccccc1)C(=O)N[C@@H](CO)C(=O)N1CCC[C@H]1C(=O)N[C@@H](Cc1ccccc1)C(O)=O
: