Target
Microtubule-associated protein 2
Ligand
BDBM50435196
Substrate
Meas. Tech.
ChEMBL_963502 (CHEMBL2394383)
EC50
>300000±n/a nM
Citation
 Zhang, PYang, XZhang, FGabelli, SBWang, RZhang, YBhat, SChen, XFurlani, MAmzel, LMLiu, JOMa, D Pyridinylpyrimidines selectively inhibit human methionine aminopeptidase-1. Bioorg Med Chem 21:2600-17 (2013)  
Target
Name:
Microtubule-associated protein 2
Synonyms:
MAP-2 MTAP2_HUMAN
Type:
PROTEIN
Mol. Mass.:
199423.64
Organism:
Homo sapiens (Human)
Description:
ChEMBL_107603
Residue:
1827
  
Inhibitor
Name:
BDBM50435196
Synonyms:
CHEMBL2392920
Type:
Small organic molecule
Emp. Form.:
C27H27Cl2N5
Mol. Mass.:
492.443
SMILES:
Cc1nc(nc(NC[C@H](NCCCc2ccccc2)c2ccccc2)c1Cl)-c1ccc(Cl)cn1
: