Target
Acetylcholinesterase
Ligand
BDBM50435290
Substrate
Meas. Tech.
ChEMBL_963636 (CHEMBL2395155)
IC50
0.932000±n/a nM
Citation
 Eckroat, TJGreen, KDReed, RABornstein, JJGarneau-Tsodikova, S Investigation of the role of linker moieties in bifunctional tacrine hybrids. Bioorg Med Chem 21:3614-23 (2013)  
Target
Name:
Acetylcholinesterase
Synonyms:
ACES_ELEEL Acetylcholinesterase (EeAChE) | ache
Type:
Enzyme
Mol. Mass.:
71812.79
Organism:
Electrophorus electricus (Electric eel)
Description:
Residue:
633
  
Inhibitor
Name:
BDBM50435290
Synonyms:
CHEMBL2393096
Type:
Small organic molecule
Emp. Form.:
C23H34ClN3
Mol. Mass.:
387.989
SMILES:
NCCCCCCCCCCNc1c2CCCCc2nc2cc(Cl)ccc12
: