Target
Dual specificity tyrosine-phosphorylation-regulated kinase 1A
Ligand
BDBM50435449
Substrate
Meas. Tech.
ChEMBL_965909 (CHEMBL2394340)
IC50
4.0±n/a nM
Citation
 Coombs, TCTanega, CShen, MWang, JLAuld, DSGerritz, SWSchoenen, FJThomas, CJAubé, J Small-molecule pyrimidine inhibitors of the cdc2-like (Clk) and dual specificity tyrosine phosphorylation-regulated (Dyrk) kinases: development of chemical probe ML315. Bioorg Med Chem Lett 23:3654-61 (2013)  
Target
Name:
Dual specificity tyrosine-phosphorylation-regulated kinase 1A
Synonyms:
DYR1A_HUMAN DYRK1A Dual specificity YAK1-related kinase 1A (Dyrk1A) Dual-specificity tyrosine-phosphorylation regulated kinase 1A HP86 MNBH
Type:
Enzyme
Mol. Mass.:
85616.61
Organism:
Homo sapiens (Human)
Description:
Q13627
Residue:
763
  
Inhibitor
Name:
BDBM50435449
Synonyms:
CHEMBL2392364
Type:
Small organic molecule
Emp. Form.:
C18H13Cl2N3O2
Mol. Mass.:
374.221
SMILES:
Clc1cc(Cl)cc(CNc2nccc(n2)-c2ccc3OCOc3c2)c1
: