Target
C-C chemokine receptor type 1
Ligand
BDBM50435666
Substrate
Meas. Tech.
ChEMBL_964990 (CHEMBL2396023)
IC50
1.9±n/a nM
Citation
 Hossain, NIvanova, SBergare, JMensonides-Harsema, MCooper, ME Design, synthesis and structure activity relationships of spirocyclic compounds as potent CCR1 antagonists. Bioorg Med Chem Lett 23:3500-4 (2013)  
Target
Name:
C-C chemokine receptor type 1
Synonyms:
C-C CKR-1 CC-CKR-1 CCR1 CD_antigen=CD191 CMKR1 LD78 receptor Macrophage inflammatory protein 1-alpha receptor SCYAR1
Type:
Enzyme
Mol. Mass.:
41180.69
Organism:
Homo sapiens (Human)
Description:
P32246
Residue:
355
  
Inhibitor
Name:
BDBM50435666
Synonyms:
CHEMBL2391804
Type:
Small organic molecule
Emp. Form.:
C26H31ClN2O6
Mol. Mass.:
502.987
SMILES:
O[C@H](COc1cc(O)ccc1C(=O)N1CC[C@H](O)C1)CN1CCC2(Cc3cc(Cl)ccc3O2)CC1
: