Target
Aryl hydrocarbon receptor
Ligand
BDBM81975
Substrate
Meas. Tech.
ChEMBL_964291 (CHEMBL2395405)
EC50
300±n/a nM
Citation
 Funke, MThimm, DSchiedel, ACMüller, CE 8-Benzamidochromen-4-one-2-carboxylic acids: potent and selective agonists for the orphan G protein-coupled receptor GPR35. J Med Chem 56:5182-97 (2013)  
Target
Name:
Aryl hydrocarbon receptor
Synonyms:
AHR BHLHE76 aryl hydrocarbon receptor precursor
Type:
PROTEIN
Mol. Mass.:
96143.77
Organism:
Homo sapiens (Human)
Description:
ChEMBL_1503828
Residue:
848
  
Inhibitor
Name:
BDBM81975
Synonyms:
4-hydroxyquinoline-2-carboxylic acid CHEMBL299155 NSC_5280455
Type:
Small organic molecule
Emp. Form.:
C10H7NO3
Mol. Mass.:
189.1675
SMILES:
OC(=O)c1cc(O)c2ccccc2n1
: