Target
Neuronal acetylcholine receptor subunit alpha-7
Ligand
BDBM81975
Substrate
Meas. Tech.
ChEMBL_964293 (CHEMBL2395407)
IC50
7000±n/a nM
Citation
 Funke, MThimm, DSchiedel, ACMüller, CE 8-Benzamidochromen-4-one-2-carboxylic acids: potent and selective agonists for the orphan G protein-coupled receptor GPR35. J Med Chem 56:5182-97 (2013)  
Target
Name:
Neuronal acetylcholine receptor subunit alpha-7
Synonyms:
ACHA7_HUMAN Cholinergic, Nicotinic Alpha7 Neuronal acetylcholine receptor protein alpha-7 subunit Nicotinic acetylcholine receptor alpha-7 (alpha7 nAChR)
Type:
Mol. Mass.:
56448.33
Organism:
Homo sapiens (Human)
Description:
CHRNA7 (NACHRA7)
Residue:
502
  
Inhibitor
Name:
BDBM81975
Synonyms:
4-hydroxyquinoline-2-carboxylic acid CHEMBL299155 NSC_5280455
Type:
Small organic molecule
Emp. Form.:
C10H7NO3
Mol. Mass.:
189.1675
SMILES:
OC(=O)c1cc(O)c2ccccc2n1
: