Target
G protein-coupled receptor GPR35
Ligand
BDBM50436003
Substrate
Meas. Tech.
ChEMBL_964307 (CHEMBL2395569)
EC50
3250±n/a nM
Citation
 Funke, MThimm, DSchiedel, ACMüller, CE 8-Benzamidochromen-4-one-2-carboxylic acids: potent and selective agonists for the orphan G protein-coupled receptor GPR35. J Med Chem 56:5182-97 (2013)  
Target
Name:
G protein-coupled receptor GPR35
Synonyms:
GPR35
Type:
PROTEIN
Mol. Mass.:
34295.07
Organism:
Rattus norvegicus
Description:
ChEMBL_107605
Residue:
306
  
Inhibitor
Name:
BDBM50436003
Synonyms:
CHEMBL2392172
Type:
Small organic molecule
Emp. Form.:
C17H8BrCl2NO5
Mol. Mass.:
457.059
SMILES:
OC(=O)c1cc(=O)c2cc(Br)cc(NC(=O)c3ccc(Cl)c(Cl)c3)c2o1
: