Target
Sterol O-acyltransferase 1
Ligand
BDBM50436124
Substrate
Meas. Tech.
ChEMBL_968102 (CHEMBL2398960)
IC50
32±n/a nM
Citation
 Eguchi, KFujiwara, YHayashida, AHorlad, HKato, HRotinsulu, HLosung, FMangindaan, REde Voogd, NJTakeya, MTsukamoto, S Manzamine A, a marine-derived alkaloid, inhibits accumulation of cholesterol ester in macrophages and suppresses hyperlipidemia and atherosclerosis in vivo. Bioorg Med Chem 21:3831-8 (2013)  
Target
Name:
Sterol O-acyltransferase 1
Synonyms:
ACACT ACAT Acetyl-CoA acetyltransferase, mitochondrial Acyl-CoA: cholesterol acyltransferase (ACAT) Cholesterol acyltransferase 1 SOAT1 STAT
Type:
Multi-pass membrane protein may form homo- or heterodimers.
Mol. Mass.:
64751.94
Organism:
Homo sapiens (Human)
Description:
P35610
Residue:
550
  
Inhibitor
Name:
BDBM50436124
Synonyms:
CHEMBL2397474
Type:
Small organic molecule
Emp. Form.:
C33H61N3O6
Mol. Mass.:
595.8539
SMILES:
CCCCCCCCCN(CC(C)(C)C)C(=O)N[C@H]1CCCC[C@@H]1OC(=O)CCNC(=O)[C@@H]1OC(C)(C)OCC1(C)C
: