Target
Sterol O-acyltransferase 2
Ligand
BDBM50232478
Substrate
Meas. Tech.
ChEMBL_968111 (CHEMBL2398969)
IC50
4800±n/a nM
Citation
 Eguchi, KFujiwara, YHayashida, AHorlad, HKato, HRotinsulu, HLosung, FMangindaan, REde Voogd, NJTakeya, MTsukamoto, S Manzamine A, a marine-derived alkaloid, inhibits accumulation of cholesterol ester in macrophages and suppresses hyperlipidemia and atherosclerosis in vivo. Bioorg Med Chem 21:3831-8 (2013)  
Target
Name:
Sterol O-acyltransferase 2
Synonyms:
ACACT2 ACAT2 Acetyl-CoA transferase-like protein Cholesterol acyltransferase 2 SOAT2 | SOAT2_HUMAN
Type:
Enzyme
Mol. Mass.:
59912.75
Organism:
Homo sapiens (Human)
Description:
O75908
Residue:
522
  
Inhibitor
Name:
BDBM50232478
Synonyms:
CHEMBL403233
Type:
Small organic molecule
Emp. Form.:
C36H44N4O
Mol. Mass.:
548.7608
SMILES:
O[C@@]12CC\C=C/CCCCN3CC[C@@H](C(=C1)c1nccc4c5ccccc5[nH]c14)[C@]1(C[C@@H]4\C=C/CCCCN4[C@@H]21)C3
: