Target
Sterol O-acyltransferase 1
Ligand
BDBM50069900
Substrate
Meas. Tech.
ChEMBL_968099 (CHEMBL2398957)
IC50
23500±n/a nM
Citation
 Eguchi, KFujiwara, YHayashida, AHorlad, HKato, HRotinsulu, HLosung, FMangindaan, REde Voogd, NJTakeya, MTsukamoto, S Manzamine A, a marine-derived alkaloid, inhibits accumulation of cholesterol ester in macrophages and suppresses hyperlipidemia and atherosclerosis in vivo. Bioorg Med Chem 21:3831-8 (2013)  
Target
Name:
Sterol O-acyltransferase 1
Synonyms:
ACACT ACAT Acetyl-CoA acetyltransferase, mitochondrial Acyl-CoA: cholesterol acyltransferase (ACAT) Cholesterol acyltransferase 1 SOAT1 STAT
Type:
Multi-pass membrane protein may form homo- or heterodimers.
Mol. Mass.:
64751.94
Organism:
Homo sapiens (Human)
Description:
P35610
Residue:
550
  
Inhibitor
Name:
BDBM50069900
Synonyms:
2,6-diisopropylphenyl 2-(2,4,6-triisopropylphenyl)acetylsulfamate CHEMBL101309 [2-(2,4,6-Triisopropyl-phenyl)-acetyl]-sulfamic acid 2,6-diisopropyl-phenyl ester
Type:
Small organic molecule
Emp. Form.:
C29H43NO4S
Mol. Mass.:
501.721
SMILES:
CC(C)c1cc(C(C)C)c(CC(=O)NS(=O)(=O)Oc2c(cccc2C(C)C)C(C)C)c(c1)C(C)C
: