Target
Bile acid receptor
Ligand
BDBM21725
Substrate
Meas. Tech.
ChEMBL_967659 (CHEMBL2399389)
IC50
12000±n/a nM
Citation
 Yu, DDLin, WChen, TForman, BM Development of time resolved fluorescence resonance energy transfer-based assay for FXR antagonist discovery. Bioorg Med Chem 21:4266-78 (2013)  
Target
Name:
Bile acid receptor
Synonyms:
BAR FXR HRR1 NR1H4_HUMAN RIP14 Retinoid X receptor-interacting protein 14 | farnesoid x receptor
Type:
Nuclear Receptor
Mol. Mass.:
55916.24
Organism:
Homo sapiens (Human)
Description:
Q96RI1
Residue:
486
  
Inhibitor
Name:
BDBM21725
Synonyms:
(1S,2R,10R,11S,14Z,15S)-14-ethylidene-2,15-dimethyltetracyclo[8.7.0.0^{2,7}.0^{11,15}]heptadec-6-ene-5,13-dione | Guggulsterone
Type:
Steroid
Emp. Form.:
C21H28O2
Mol. Mass.:
312.4458
SMILES:
[H][C@@]12CC(=O)C(=CC)[C@@]1(C)CC[C@@]1([H])[C@@]2([H])CCC2=CC(=O)CC[C@]12C
: