Target
Presenilin-1
Ligand
BDBM50436205
Substrate
Meas. Tech.
ChEMBL_966384 (CHEMBL2398821)
EC50
11000±n/a nM
Citation
 Naumann, ECGöring, SOgorek, IWeggen, SSchmidt, B Membrane anchoring¿-secretase modulators with terpene-derived moieties. Bioorg Med Chem Lett 23:3852-6 (2013)  
Target
Name:
Presenilin-1
Synonyms:
3.4.23.- Gamma-Secretase Subunit Presenilin-1 PS1 PSEN1 PSNL1 Presenilin-1 CTF12 Protein S182
Type:
Mol. Mass.:
52657.13
Organism:
Homo sapiens (Human)
Description:
P49768
Residue:
467
  
Inhibitor
Name:
BDBM50436205
Synonyms:
CHEMBL2398579
Type:
Small organic molecule
Emp. Form.:
C24H36O6
Mol. Mass.:
420.539
SMILES:
CCCCCCCCOC(=O)C1(C)CCc2c(C)c(OCC(O)=O)c(C)c(C)c2O1
: