Target
Sterol O-acyltransferase 2
Ligand
BDBM50436339
Substrate
Meas. Tech.
ChEMBL_966605 (CHEMBL2399639)
IC50
14±n/a nM
Citation
 Ohtawa, MYamazaki, HOhte, SMatsuda, DOhshiro, TRudel, LLOmura, STomoda, HNagamitsu, T Synthesis and structure-activity relationship of pyripyropene A derivatives as potent and selective acyl-CoA:cholesterol acyltransferase 2 (ACAT2) inhibitors: part 3. Bioorg Med Chem Lett 23:3798-801 (2013)  
Target
Name:
Sterol O-acyltransferase 2
Synonyms:
ACACT2 ACAT2 Acetyl-CoA transferase-like protein Cholesterol acyltransferase 2 SOAT2 | SOAT2_HUMAN
Type:
Enzyme
Mol. Mass.:
59912.75
Organism:
Homo sapiens (Human)
Description:
O75908
Residue:
522
  
Inhibitor
Name:
BDBM50436339
Synonyms:
CHEMBL2396678
Type:
Small organic molecule
Emp. Form.:
C40H41NO9
Mol. Mass.:
679.7548
SMILES:
COc1ccc(cc1)C(=O)O[C@H]1C[C@H]2[C@]3(C)CO[C@H](O[C@H]3CC[C@]2(C)[C@H]2[C@@H](O)c3c(O[C@]12C)cc(oc3=O)-c1cccnc1)c1ccccc1
: