Target
Sterol O-acyltransferase 2
Ligand
BDBM50436343
Substrate
Meas. Tech.
ChEMBL_966605 (CHEMBL2399639)
IC50
7.0±n/a nM
Citation
 Ohtawa, MYamazaki, HOhte, SMatsuda, DOhshiro, TRudel, LLOmura, STomoda, HNagamitsu, T Synthesis and structure-activity relationship of pyripyropene A derivatives as potent and selective acyl-CoA:cholesterol acyltransferase 2 (ACAT2) inhibitors: part 3. Bioorg Med Chem Lett 23:3798-801 (2013)  
Target
Name:
Sterol O-acyltransferase 2
Synonyms:
ACACT2 ACAT2 Acetyl-CoA transferase-like protein Cholesterol acyltransferase 2 SOAT2 | SOAT2_HUMAN
Type:
Enzyme
Mol. Mass.:
59912.75
Organism:
Homo sapiens (Human)
Description:
O75908
Residue:
522
  
Inhibitor
Name:
BDBM50436343
Synonyms:
CHEMBL2398816
Type:
Small organic molecule
Emp. Form.:
C39H38FNO8
Mol. Mass.:
667.7193
SMILES:
C[C@@]12CO[C@H](O[C@H]1CC[C@@]1(C)[C@H]2C[C@H](OC(=O)c2ccc(F)cc2)[C@@]2(C)Oc3cc(oc(=O)c3[C@H](O)[C@H]12)-c1cccnc1)c1ccccc1
: