Target
Sterol O-acyltransferase 2
Ligand
BDBM50436346
Substrate
Meas. Tech.
ChEMBL_966605 (CHEMBL2399639)
IC50
7.2±n/a nM
Citation
 Ohtawa, MYamazaki, HOhte, SMatsuda, DOhshiro, TRudel, LLOmura, STomoda, HNagamitsu, T Synthesis and structure-activity relationship of pyripyropene A derivatives as potent and selective acyl-CoA:cholesterol acyltransferase 2 (ACAT2) inhibitors: part 3. Bioorg Med Chem Lett 23:3798-801 (2013)  
Target
Name:
Sterol O-acyltransferase 2
Synonyms:
ACACT2 ACAT2 Acetyl-CoA transferase-like protein Cholesterol acyltransferase 2 SOAT2 | SOAT2_HUMAN
Type:
Enzyme
Mol. Mass.:
59912.75
Organism:
Homo sapiens (Human)
Description:
O75908
Residue:
522
  
Inhibitor
Name:
BDBM50436346
Synonyms:
CHEMBL2398813
Type:
Small organic molecule
Emp. Form.:
C42H42N2O8
Mol. Mass.:
702.7915
SMILES:
Cc1cccc(C)c1[C@@H]1OC[C@]2(C)[C@H](CC[C@@]3(C)[C@H]2C[C@H](OC(=O)c2ccc(cc2)C#N)[C@@]2(C)Oc4cc(oc(=O)c4[C@H](O)[C@H]32)-c2cccnc2)O1
: