Target
Tyrosine-protein phosphatase non-receptor type 22
Ligand
BDBM50436364
Substrate
Meas. Tech.
ChEMBL_966983 (CHEMBL2401470)
IC50
300±n/a nM
Citation
 He, YLiu, SMenon, AStanford, SOppong, EGunawan, AMWu, LWu, DJBarrios, AMBottini, NCato, ACZhang, ZY A potent and selective small-molecule inhibitor for the lymphoid-specific tyrosine phosphatase (LYP), a target associated with autoimmune diseases. J Med Chem 56:4990-5008 (2013)  
Target
Name:
Tyrosine-protein phosphatase non-receptor type 22
Synonyms:
3.1.3.48 LyP Lymphoid phosphatase (Lyp) PEST-domain phosphatase PTPN22 Tyrosine-protein phosphatase non-receptor type 22 (LYP) | tyrosine-protein phosphatase non-receptor type 22 isoform 1
Type:
Mol. Mass.:
91712.31
Organism:
Homo sapiens (Human)
Description:
Q9Y2R2
Residue:
807
  
Inhibitor
Name:
BDBM50436364
Synonyms:
CHEMBL2396717
Type:
Small organic molecule
Emp. Form.:
C34H26ClNO6
Mol. Mass.:
580.026
SMILES:
CC(C)c1ccc(NC(=O)COc2cccc(c2)-c2oc3cc(O)c(cc3c2C#Cc2cccc(Cl)c2)C(O)=O)cc1
: