Target
Phosphatidylinositol 4-kinase beta
Ligand
BDBM50436477
Substrate
Meas. Tech.
ChEMBL_966466 (CHEMBL2399054)
IC50
53±n/a nM
Citation
 Décor, AGrand-Maître, CHucke, OO'Meara, JKuhn, CConstantineau-Forget, LBrochu, CMalenfant, EBertrand-Laperle, MBordeleau, JGhiro, EPesant, MFazal, GGorys, VLittle, MBoucher, CBordeleau, STurcotte, PGuo, TGarneau, MSpickler, CGauthier, A Design, synthesis and biological evaluation of novel aminothiazoles as antiviral compounds acting against human rhinovirus. Bioorg Med Chem Lett 23:3841-7 (2013)  
Target
Name:
Phosphatidylinositol 4-kinase beta
Synonyms:
NPIK PI4K-beta PI4KB PI4Kbeta PIK4CB Phosphatidylinositol 4-kinase, PI4K | PtdIns 4-kinase beta
Type:
Protein
Mol. Mass.:
91373.30
Organism:
Homo sapiens (Human)
Description:
Residue:
816
  
Inhibitor
Name:
BDBM50436477
Synonyms:
CHEMBL2397315
Type:
Small organic molecule
Emp. Form.:
C14H15F3N4OS
Mol. Mass.:
344.355
SMILES:
C[C@@H](CC(F)(F)F)C(=O)Nc1nc(C)c(s1)-c1ccc(N)nc1
: