Target
Cytochrome P450 3A4
Ligand
BDBM50005005
Substrate
Meas. Tech.
ChEMBL_966467 (CHEMBL2399055)
IC50
>30000±n/a nM
Citation
 Décor, AGrand-Maître, CHucke, OO'Meara, JKuhn, CConstantineau-Forget, LBrochu, CMalenfant, EBertrand-Laperle, MBordeleau, JGhiro, EPesant, MFazal, GGorys, VLittle, MBoucher, CBordeleau, STurcotte, PGuo, TGarneau, MSpickler, CGauthier, A Design, synthesis and biological evaluation of novel aminothiazoles as antiviral compounds acting against human rhinovirus. Bioorg Med Chem Lett 23:3841-7 (2013)  
Target
Name:
Cytochrome P450 3A4
Synonyms:
Albendazole monooxygenase CP3A4_HUMAN CYP3A4 CYPIIIA4 Cytochrome P450 3A4 (CYP3A4) Nifedipine oxidase Taurochenodeoxycholate 6-alpha-hydroxylase
Type:
Enzyme
Mol. Mass.:
57349.57
Organism:
Homo sapiens (Human)
Description:
Residue:
503
  
Inhibitor
Name:
BDBM50005005
Synonyms:
CHEMBL2397317
Type:
Small organic molecule
Emp. Form.:
C22H29N5O3
Mol. Mass.:
411.4974
SMILES:
COc1ccc(cc1OC)-c1c(C)nn2c(NCCN3CCOCC3)cc(C)nc12
: