Target
Dual specificity tyrosine-phosphorylation-regulated kinase 3
Ligand
BDBM50436477
Substrate
Meas. Tech.
ChEMBL_966447 (CHEMBL2399035)
IC50
10000±n/a nM
Citation
 Décor, AGrand-Maître, CHucke, OO'Meara, JKuhn, CConstantineau-Forget, LBrochu, CMalenfant, EBertrand-Laperle, MBordeleau, JGhiro, EPesant, MFazal, GGorys, VLittle, MBoucher, CBordeleau, STurcotte, PGuo, TGarneau, MSpickler, CGauthier, A Design, synthesis and biological evaluation of novel aminothiazoles as antiviral compounds acting against human rhinovirus. Bioorg Med Chem Lett 23:3841-7 (2013)  
Target
Name:
Dual specificity tyrosine-phosphorylation-regulated kinase 3
Synonyms:
DYRK3 Dual-specificity tyrosine-phosphorylation regulated kinase 3
Type:
PROTEIN
Mol. Mass.:
65747.26
Organism:
Homo sapiens (Human)
Description:
ChEMBL_1508026
Residue:
588
  
Inhibitor
Name:
BDBM50436477
Synonyms:
CHEMBL2397315
Type:
Small organic molecule
Emp. Form.:
C14H15F3N4OS
Mol. Mass.:
344.355
SMILES:
C[C@@H](CC(F)(F)F)C(=O)Nc1nc(C)c(s1)-c1ccc(N)nc1
: