Target
D(3) dopamine receptor
Ligand
BDBM50436542
Substrate
Meas. Tech.
ChEMBL_966818 (CHEMBL2400819)
Ki
0.120000±n/a nM
Citation
 Hiller, CKling, RCHeinemann, FWMeyer, KHübner, HGmeiner, P Functionally selective dopamine D2/D3 receptor agonists comprising an enyne moiety. J Med Chem 56:5130-41 (2013)  
Target
Name:
D(3) dopamine receptor
Synonyms:
DOPAMINE D3 DRD3_HUMAN Dopamine D3 receptor (D3) Dopamine receptor Dopamine receptor D3
Type:
Mol. Mass.:
44243.43
Organism:
Homo sapiens (Human)
Description:
Residue:
400
  
Inhibitor
Name:
BDBM50436542
Synonyms:
CHEMBL2397389
Type:
Small organic molecule
Emp. Form.:
C28H34N2O
Mol. Mass.:
414.5824
SMILES:
CCCN(CCCCNC(=O)c1ccc(cc1)-c1ccccc1)[C@@H]1CCC(=CC1)C#C
: