Target
5'-AMP-activated protein kinase catalytic subunit alpha-2
Ligand
BDBM50436622
Substrate
Meas. Tech.
ChEMBL_967438 (CHEMBL2401228)
EC50
76100±n/a nM
Citation
 Meltzer-Mats, EBabai-Shani, GPasternak, LUritsky, NGetter, TViskind, OEckel, JCerasi, ESenderowitz, HSasson, SGruzman, A Synthesis and mechanism of hypoglycemic activity of benzothiazole derivatives. J Med Chem 56:5335-50 (2014)  
Target
Name:
5'-AMP-activated protein kinase catalytic subunit alpha-2
Synonyms:
AAPK2_RAT Ampk Prkaa2
Type:
PROTEIN
Mol. Mass.:
62268.49
Organism:
Rattus norvegicus
Description:
ChEMBL_967438
Residue:
552
  
Inhibitor
Name:
BDBM50436622
Synonyms:
CHEMBL568708
Type:
Small organic molecule
Emp. Form.:
C9H9NOS2
Mol. Mass.:
211.304
SMILES:
CCOc1ccc2nc(S)sc2c1
: