Target
Bcl-2-like protein 1
Ligand
BDBM50436628
Substrate
Meas. Tech.
ChEMBL_967619 (CHEMBL2399239)
IC50
60±n/a nM
Citation
 Sleebs, BEKersten, WJKulasegaram, SNikolakopoulos, GHatzis, EMoss, RMParisot, JPYang, HCzabotar, PEFairlie, WDLee, EFAdams, JMChen, Lvan Delft, MFLowes, KNWei, AHuang, DCColman, PMStreet, IPBaell, JBWatson, KLessene, G Discovery of potent and selective benzothiazole hydrazone inhibitors of Bcl-XL. J Med Chem 56:5514-40 (2014)  
Target
Name:
Bcl-2-like protein 1
Synonyms:
Anti-apoptotic Bcl-2 protein Apoptosis regulator Bcl-X BCL2-like 1 isoform 1 BCL2L1 Bcl-2-like protein 1 (Bcl-XL) Bcl-xL/Bcl-2-binding component 3 Bcl2-antagonist of cell death (BAD)
Type:
Mitochondrion membrane; Single-pass membrane protein
Mol. Mass.:
26039.60
Organism:
Homo sapiens (Human)
Description:
Residue:
233
  
Inhibitor
Name:
BDBM50436628
Synonyms:
CHEMBL2398263
Type:
Small organic molecule
Emp. Form.:
C23H18N4O2S
Mol. Mass.:
414.48
SMILES:
OC(=O)c1cc(ccn1)-c1ccc2CCCC(=NNc3nc4ccccc4s3)c2c1
: