Target
Bcl-2-like protein 1
Ligand
BDBM50436643
Substrate
Meas. Tech.
ChEMBL_967613 (CHEMBL2399233)
Kd
9000±n/a nM
Citation
 Sleebs, BEKersten, WJKulasegaram, SNikolakopoulos, GHatzis, EMoss, RMParisot, JPYang, HCzabotar, PEFairlie, WDLee, EFAdams, JMChen, Lvan Delft, MFLowes, KNWei, AHuang, DCColman, PMStreet, IPBaell, JBWatson, KLessene, G Discovery of potent and selective benzothiazole hydrazone inhibitors of Bcl-XL. J Med Chem 56:5514-40 (2014)  
Target
Name:
Bcl-2-like protein 1
Synonyms:
Anti-apoptotic Bcl-2 protein Apoptosis regulator Bcl-X BCL2-like 1 isoform 1 BCL2L1 Bcl-2-like protein 1 (Bcl-XL) Bcl-xL/Bcl-2-binding component 3 Bcl2-antagonist of cell death (BAD)
Type:
Mitochondrion membrane; Single-pass membrane protein
Mol. Mass.:
26039.60
Organism:
Homo sapiens (Human)
Description:
Residue:
233
  
Inhibitor
Name:
BDBM50436643
Synonyms:
3-(5-(1-(2-(Benzo[d]thiazol-2-yl)hydrazono)ethyl)furan-2-yl)-benzoic acid (Compound 1b) | CHEMBL2398292
Type:
Small organic molecule
Emp. Form.:
C20H15N3O3S
Mol. Mass.:
377.416
SMILES:
CC(N=Nc1nc2ccccc2s1)c1ccc(o1)-c1cccc(c1)C(O)=O
: