Target
Bcl-2-like protein 1
Ligand
BDBM50436663
Substrate
Meas. Tech.
ChEMBL_967619 (CHEMBL2399239)
IC50
1600±n/a nM
Citation
 Sleebs, BEKersten, WJKulasegaram, SNikolakopoulos, GHatzis, EMoss, RMParisot, JPYang, HCzabotar, PEFairlie, WDLee, EFAdams, JMChen, Lvan Delft, MFLowes, KNWei, AHuang, DCColman, PMStreet, IPBaell, JBWatson, KLessene, G Discovery of potent and selective benzothiazole hydrazone inhibitors of Bcl-XL. J Med Chem 56:5514-40 (2014)  
Target
Name:
Bcl-2-like protein 1
Synonyms:
Anti-apoptotic Bcl-2 protein Apoptosis regulator Bcl-X BCL2-like 1 isoform 1 BCL2L1 Bcl-2-like protein 1 (Bcl-XL) Bcl-xL/Bcl-2-binding component 3 Bcl2-antagonist of cell death (BAD)
Type:
Mitochondrion membrane; Single-pass membrane protein
Mol. Mass.:
26039.60
Organism:
Homo sapiens (Human)
Description:
Residue:
233
  
Inhibitor
Name:
BDBM50436663
Synonyms:
CHEMBL2398282
Type:
Small organic molecule
Emp. Form.:
C20H14ClN3O2S2
Mol. Mass.:
427.927
SMILES:
CC(N=Nc1nc2ccccc2s1)c1ccc(s1)-c1ccc(Cl)c(c1)C(O)=O
: