Target
Bcl-2-like protein 1
Ligand
BDBM50436674
Substrate
Meas. Tech.
ChEMBL_967619 (CHEMBL2399239)
IC50
55±n/a nM
Citation
 Sleebs, BEKersten, WJKulasegaram, SNikolakopoulos, GHatzis, EMoss, RMParisot, JPYang, HCzabotar, PEFairlie, WDLee, EFAdams, JMChen, Lvan Delft, MFLowes, KNWei, AHuang, DCColman, PMStreet, IPBaell, JBWatson, KLessene, G Discovery of potent and selective benzothiazole hydrazone inhibitors of Bcl-XL. J Med Chem 56:5514-40 (2014)  
Target
Name:
Bcl-2-like protein 1
Synonyms:
Anti-apoptotic Bcl-2 protein Apoptosis regulator Bcl-X BCL2-like 1 isoform 1 BCL2L1 Bcl-2-like protein 1 (Bcl-XL) Bcl-xL/Bcl-2-binding component 3 Bcl2-antagonist of cell death (BAD)
Type:
Mitochondrion membrane; Single-pass membrane protein
Mol. Mass.:
26039.60
Organism:
Homo sapiens (Human)
Description:
Residue:
233
  
Inhibitor
Name:
BDBM50436674
Synonyms:
CHEMBL2398253
Type:
Small organic molecule
Emp. Form.:
C22H16N4O3S
Mol. Mass.:
416.452
SMILES:
OC(=O)c1cccc(n1)-c1ccc2OCCC(=NNc3nc4ccccc4s3)c2c1
: