Target
Bcl-2-like protein 1
Ligand
BDBM21447
Substrate
Meas. Tech.
ChEMBL_967619 (CHEMBL2399239)
IC50
0.500000±n/a nM
Citation
 Sleebs, BEKersten, WJKulasegaram, SNikolakopoulos, GHatzis, EMoss, RMParisot, JPYang, HCzabotar, PEFairlie, WDLee, EFAdams, JMChen, Lvan Delft, MFLowes, KNWei, AHuang, DCColman, PMStreet, IPBaell, JBWatson, KLessene, G Discovery of potent and selective benzothiazole hydrazone inhibitors of Bcl-XL. J Med Chem 56:5514-40 (2014)  
Target
Name:
Bcl-2-like protein 1
Synonyms:
Anti-apoptotic Bcl-2 protein Apoptosis regulator Bcl-X BCL2-like 1 isoform 1 BCL2L1 Bcl-2-like protein 1 (Bcl-XL) Bcl-xL/Bcl-2-binding component 3 Bcl2-antagonist of cell death (BAD)
Type:
Mitochondrion membrane; Single-pass membrane protein
Mol. Mass.:
26039.60
Organism:
Homo sapiens (Human)
Description:
Residue:
233
  
Inhibitor
Name:
BDBM21447
Synonyms:
4-(4-{[2-(4-chlorophenyl)phenyl]methyl}piperazin-1-yl)-N-[(4-{[(2R)-4-(dimethylamino)-1-(phenylsulfanyl)butan-2-yl]amino}-3-nitrobenzene)sulfonyl]benzamide CHEMBL376408 US11760752, Compound ABT-737 | US9125913, ABT-737
Type:
Small organic molecule
Emp. Form.:
C42H45ClN6O5S2
Mol. Mass.:
813.427
SMILES:
CN(C)CC[C@H](CSc1ccccc1)Nc1ccc(cc1[N+]([O-])=O)S(=O)(=O)NC(=O)c1ccc(cc1)N1CCN(Cc2ccccc2-c2ccc(Cl)cc2)CC1
: