Target
Serine/threonine-protein kinase PLK1
Ligand
BDBM50436734
Substrate
Meas. Tech.
ChEMBL_971432 (CHEMBL2406145)
IC50
3420±n/a nM
Citation
 Bowers, STruong, APYe, MAubele, DLSealy, JMNeitz, RJHom, RKChan, WDappen, MSGalemmo, RAKonradi, AWSham, HLZhu, YLBeroza, PTonn, GZhang, HHoffman, JMotter, RFauss, DTanaka, PBova, MPRen, ZTam, DRuslim, LBaker, JPandya, DDiep, LFitzgerald, KArtis, DRAnderson, JPBergeron, M Design and synthesis of highly selective, orally active Polo-like kinase-2 (Plk-2) inhibitors. Bioorg Med Chem Lett 23:2743-9 (2013)  
Target
Name:
Serine/threonine-protein kinase PLK1
Synonyms:
PLK PLK1 Polo-like kinase 1 (PlK1) STPK13 Serine/threonine-protein kinase 13 | polo-like kinase
Type:
Serine/threonine-protein kinase
Mol. Mass.:
68277.16
Organism:
Homo sapiens (Human)
Description:
P53350
Residue:
603
  
Inhibitor
Name:
BDBM50436734
Synonyms:
CHEMBL2402079
Type:
Small organic molecule
Emp. Form.:
C21H19FN8O
Mol. Mass.:
418.427
SMILES:
CCC1N(c2ccn[nH]2)c2nc(ncc2N(C)C1=O)-n1ccnc1-c1ccc(F)cc1
: