Target
Insulin receptor
Ligand
BDBM50436856
Substrate
Meas. Tech.
ChEMBL_971485 (CHEMBL2406363)
IC50
339±n/a nM
Citation
 Marsilje, THPei, WChen, BLu, WUno, TJin, YJiang, TKim, SLi, NWarmuth, MSarkisova, YSun, FSteffy, APferdekamper, ACLi, AGJoseph, SBKim, YLiu, BTuntland, TCui, XGray, NSSteensma, RWan, YJiang, JChopiuk, GLi, JGordon, WPRichmond, WJohnson, KChang, JGroessl, THe, YQPhimister, AAycinena, ALee, CCBursulaya, BKaranewsky, DSSeidel, HMHarris, JLMichellys, PY Synthesis, structure-activity relationships, and in vivo efficacy of the novel potent and selective anaplastic lymphoma kinase (ALK) inhibitor 5-chloro-N2-(2-isopropoxy-5-methyl-4-(piperidin-4-yl)phenyl)-N4-(2-(isopropylsulfonyl)phenyl)pyrimidine-2,4-diamine (LDK378) currently in phase 1 and phase  J Med Chem 56:5675-90 (2014)  
Target
Name:
Insulin receptor
Synonyms:
INSR INSR_HUMAN Insulin receptor beta subunit
Type:
Receptor Tyrosine Kinase
Mol. Mass.:
156322.60
Organism:
Homo sapiens (Human)
Description:
P06213
Residue:
1382
  
Inhibitor
Name:
BDBM50436856
Synonyms:
CHEMBL2403833
Type:
Small organic molecule
Emp. Form.:
C28H37ClN6O3S
Mol. Mass.:
573.15
SMILES:
CC(C)Oc1cc(C2CCN(C)CC2)c(C)cc1Nc1ncc(Cl)c(Nc2ccccc2S(=O)(=O)N(C)C)n1
: