Target
Fatty-acid amide hydrolase 1 [30-579]
Ligand
BDBM50437233
Substrate
Meas. Tech.
ChEMBL_969749 (CHEMBL2404091)
IC50
0.300000±n/a nM
Citation
 Moreno-Sanz, GDuranti, AMelzig, LFiorelli, CRuda, GFColombano, GMestichelli, PSanchini, STontini, AMor, MBandiera, TScarpelli, RTarzia, GPiomelli, D Synthesis and structure-activity relationship studies of O-biphenyl-3-yl carbamates as peripherally restricted fatty acid amide hydrolase inhibitors. J Med Chem 56:5917-30 (2014)  
Target
Name:
Fatty-acid amide hydrolase 1 [30-579]
Synonyms:
Anandamide amidohydrolase 1 Faah Fatty Acid Amide Hydrolase Fatty-acid amide hydrolase (FAAH) Fatty-acid amide hydrolase 1 (FAAH) Oleamide hydrolase 1
Type:
Single-pass membrane protein; homodimer
Mol. Mass.:
60474.00
Organism:
Rattus norvegicus (rat)
Description:
P97612 (aa 30-579)
Residue:
550
  
Inhibitor
Name:
BDBM50437233
Synonyms:
CHEMBL2402911
Type:
Small organic molecule
Emp. Form.:
C21H23NO4
Mol. Mass.:
353.4116
SMILES:
CC(=O)c1cccc(c1)-c1cc(OC(=O)NC2CCCCC2)ccc1O
: