Target
Major prion protein
Ligand
BDBM50437262
Substrate
Meas. Tech.
ChEMBL_972294 (CHEMBL2411805)
EC50
165±n/a nM
Citation
 Li, ZRao, SGever, JRWidjaja, KPrusiner, SBSilber, BM Optimization of Arylamides as Novel, Potent and Brain-penetrant Antiprion Lead Compounds. ACS Med Chem Lett 4:647-650 (2013)  
Target
Name:
Major prion protein
Synonyms:
CD_antigen=CD230 PRNP SIP
Type:
PROTEIN
Mol. Mass.:
27930.26
Organism:
Ovis aries
Description:
ChEMBL_107628
Residue:
256
  
Inhibitor
Name:
BDBM50437262
Synonyms:
CHEMBL2407259
Type:
Small organic molecule
Emp. Form.:
C25H28N4O
Mol. Mass.:
400.516
SMILES:
CC(C)N1CCN(CC1)c1ccc(NC(=O)c2ccc(cc2)-c2ccccn2)cc1
: