Target
Methionine aminopeptidase 1
Ligand
BDBM76305
Substrate
Meas. Tech.
ChEMBL_972464 (CHEMBL2412834)
IC50
12900±n/a nM
Citation
 Wangtrakuldee, PByrd, MSCampos, CGHenderson, MWZhang, ZClare, MMasoudi, AMyler, PJHorn, JRCotter, PAHagen, TJ Discovery of Inhibitors of ACS Med Chem Lett 4:699-703 (2013)  
Target
Name:
Methionine aminopeptidase 1
Synonyms:
Aminopeptidase MAP 1 METAP1 Methionine Aminopeptidase Type 1 (MetAP1) | Peptidase M 1
Type:
Enzyme
Mol. Mass.:
43220.79
Organism:
Homo sapiens (Human)
Description:
MetAP1 with an N-terminal six histidine tag was expressed in baculovirus infected sf9 cells.
Residue:
386
  
Inhibitor
Name:
BDBM76305
Synonyms:
5-chloranylquinolin-8-ol 5-chloroquinolin-8-ol SMR000274338 | cid_2817
Type:
Small organic molecule
Emp. Form.:
C9H6ClNO
Mol. Mass.:
179.603
SMILES:
Oc1ccc(Cl)c2cccnc12
: