Target
Myoglobin
Ligand
BDBM26197
Substrate
Meas. Tech.
ChEMBL_972224 (CHEMBL2411426)
IC50
2300±n/a nM
Citation
 Shchepin, RVLiu, WYin, HZagol-Ikapitte, IAmin, TJeong, BSRoberts, LJOates, JAPorter, NABoutaud, O Rational Design of Novel Pyridinol-Fused Ring Acetaminophen Analogues. ACS Med Chem Lett 4:710-714 (2013)  
Target
Name:
Myoglobin
Synonyms:
MB | MYG_HUMAN
Type:
PROTEIN
Mol. Mass.:
17188.13
Organism:
Homo sapiens (Human)
Description:
ChEMBL_107627
Residue:
154
  
Inhibitor
Name:
BDBM26197
Synonyms:
CHEMBL112 Norco US9333197, Acetaminophen phenol derivative, 11
Type:
Small organic molecule
Emp. Form.:
C8H9NO2
Mol. Mass.:
151.1626
SMILES:
CC(=O)Nc1ccc(O)cc1
: