Target
Vitamin D3 receptor
Ligand
BDBM50437333
Substrate
Meas. Tech.
ChEMBL_972270 (CHEMBL2411781)
EC50
0.680000±n/a nM
Citation
 Matsuo, MHasegawa, ATakano, MSaito, HKakuda, SChida, TTakagi, KOchiai, EHorie, KHarada, YTakimoto-Kamimura, MTakenouchi, KSawada, DKittaka, A Synthesis of 2?-heteroarylalkyl active vitamin d3 with therapeutic effect on enhancing bone mineral density in vivo. ACS Med Chem Lett 4:671-4 (2013)  
Target
Name:
Vitamin D3 receptor
Synonyms:
1,25-dihydroxyvitamin D3 receptor Nuclear receptor subfamily 1 group I member 1 VDR | VDR_HUMAN
Type:
Protein
Mol. Mass.:
48288.72
Organism:
Homo sapiens (Human)
Description:
P11473
Residue:
427
  
Inhibitor
Name:
BDBM50437333
Synonyms:
CHEMBL2407826
Type:
Small organic molecule
Emp. Form.:
C32H50N2O3
Mol. Mass.:
510.751
SMILES:
C[C@H](CCCC(C)(C)O)[C@H]1CC[C@H]2\C(CCC[C@]12C)=C\C=C1\C[C@@H](O)[C@H](CCn2ccnc2)[C@H](O)C1=C
: