Target
Cytochrome P450 2C9
Ligand
BDBM50437353
Substrate
Meas. Tech.
ChEMBL_972422 (CHEMBL2412597)
IC50
>10000±n/a nM
Citation
 Barlaam, BAnderton, JBallard, PBradbury, RHHennequin, LFHickinson, DMKettle, JGKirk, GKlinowska, TLambert-van der Brempt, CTrigwell, CVincent, JOgilvie, D Discovery of AZD8931, an Equipotent, Reversible Inhibitor of Signaling by EGFR, HER2, and HER3 Receptors. ACS Med Chem Lett 4:742-6 (2013)  
Target
Name:
Cytochrome P450 2C9
Synonyms:
(R)-limonene 6-monooxygenase CP2C9_HUMAN CYP2C9 Cytochrome P450 2C9 (CYP2C9 ) P-450MP P450 PB-1 | S-mephenytoin 4-hydroxylase
Type:
Enzyme
Mol. Mass.:
55636.33
Organism:
Homo sapiens (Human)
Description:
P11712
Residue:
490
  
Inhibitor
Name:
BDBM50437353
Synonyms:
CHEMBL2408045
Type:
Small organic molecule
Emp. Form.:
C23H25ClFN5O3
Mol. Mass.:
473.928
SMILES:
CNC(=O)CN1CCC(CC1)Oc1cc2c(Nc3cccc(Cl)c3F)ncnc2cc1OC
: