Target
Insulin-like growth factor 1 receptor
Ligand
BDBM50315887
Substrate
Meas. Tech.
ChEMBL_972569 (CHEMBL2410391)
IC50
13±n/a nM
Citation
 Jin, MPetronella, BACooke, AKadalbajoo, MSiu, KWKleinberg, AMay, EWGokhale, PCSchulz, RKahler, JBittner, MAForeman, KPachter, JAWild, REpstein, DMulvihill, MJ Discovery of novel insulin-like growth factor-1 receptor inhibitors with unique time-dependent binding kinetics. ACS Med Chem Lett 4:627-31 (2013)  
Target
Name:
Insulin-like growth factor 1 receptor
Synonyms:
CD_antigen=CD221 IGF1R Insulin-like growth factor 1 receptor (IGF1R) Insulin-like growth factor 1 receptor alpha chain Insulin-like growth factor I receptor | Insulin-like growth factor receptor (IGFR)
Type:
Protein
Mol. Mass.:
154776.79
Organism:
Homo sapiens (Human)
Description:
P08069
Residue:
1367
  
Inhibitor
Name:
BDBM50315887
Synonyms:
(1s,3s)-3-(8-amino-1-(2-phenylquinolin-7-yl)imidazo[1,5-a]pyrazin-3-yl)-1-methylcyclobutanol OSI-906
Type:
Small organic molecule
Emp. Form.:
C26H23N5O
Mol. Mass.:
421.4937
SMILES:
C[C@@]1(O)C[C@@H](C1)c1nc(-c2ccc3ccc(nc3c2)-c2ccccc2)c2c(N)nccn12
: