Target
Diacylglycerol O-acyltransferase 1
Ligand
BDBM50437388
Substrate
Meas. Tech.
ChEMBL_972634 (CHEMBL2410614)
IC50
1.1±n/a nM
Citation
 He, SHong, QLai, ZWu, ZYu, YKim, DWTing, PCKuethe, JTYang, GXJian, TLiu, JGuiadeen, DKrikorian, ADSperbeck, DMSonatore, LMWiltsie, JChung, CCGibson, JTLisnock, JMurphy, BAGorski, JNLiu, JChen, DChen, XWolff, MTong, SXMadeira, MKaranam, BVShen, DMBalkovec, JMPinto, SNargund, RPDeVita, RJ Potent DGAT1 Inhibitors in the Benzimidazole Class with a Pyridyl-oxy-cyclohexanecarboxylic Acid Moiety. ACS Med Chem Lett 4:773-8 (2013)  
Target
Name:
Diacylglycerol O-acyltransferase 1
Synonyms:
ACAT-related gene product 1 Acyl coA-diacylglycerol acyl transferase 1 (DGAT1) DGAT1 Diacylglycerol Acyltransferase (DGAT1) Diacylglycerol O-acyltransferase 1 (DGAT1) | Diglyceride acyltransferase
Type:
Protein
Mol. Mass.:
55297.82
Organism:
Homo sapiens (Human)
Description:
O75907
Residue:
488
  
Inhibitor
Name:
BDBM50437388
Synonyms:
CHEMBL3037924
Type:
Small organic molecule
Emp. Form.:
C26H24ClN3O2
Mol. Mass.:
445.941
SMILES:
OC(=O)C[C@H]1CC[C@@H](CC1)c1ccc(cc1)-c1ccc(cn1)-c1nc2ccc(Cl)cc2[nH]1
: