Target
Dipeptidyl peptidase 4
Ligand
BDBM50228407
Substrate
Meas. Tech.
ChEMBL_972636 (CHEMBL2410616)
IC50
1±n/a nM
Citation
 Czechtizky, WDedio, JDesai, BDixon, KFarrant, EFeng, QMorgan, TParry, DMRamjee, MKSelway, CNSchmidt, TTarver, GJWright, AG Integrated Synthesis and Testing of Substituted Xanthine Based DPP4 Inhibitors: Application to Drug Discovery. ACS Med Chem Lett 4:768-72 (2013)  
Target
Name:
Dipeptidyl peptidase 4
Synonyms:
ADABP Adenosine deaminase complexing protein 2 CD_antigen=CD26 DPP4 DPPIV Dipeptidyl peptidase 4 (DPP IV) Dipeptidyl peptidase 4 (DPP4) Dipeptidyl peptidase 4 membrane form Dipeptidyl peptidase IV Dipeptidyl peptidase IV (DDP-IV) Dipeptidyl peptidase IV membrane form Dipeptidyl peptidase-IV (DPP-4) T-cell activation antigen CD26 | TP103
Type:
Enzyme
Mol. Mass.:
88271.01
Organism:
Homo sapiens (Human)
Description:
P27487
Residue:
766
  
Inhibitor
Name:
BDBM50228407
Synonyms:
8-((R)-3-amino-piperidin-1-yl)-3-methyl-7-(3-methyl-but-2-enyl)-1-(2-oxo-2-phenyl-ethyl)-3,7-dihydro-purine-2,6-dione | CHEMBL237488
Type:
Small organic molecule
Emp. Form.:
C24H30N6O3
Mol. Mass.:
450.5334
SMILES:
[#6]\[#6](-[#6])=[#6]\[#6]-n1c(nc2n(-[#6])c(=O)n(-[#6]-[#6](=O)-c3ccccc3)c(=O)c12)-[#7]-1-[#6]-[#6]-[#6]-[#6@@H](-[#7])-[#6]-1
: