Target
Dipeptidyl peptidase 4
Ligand
BDBM50437403
Substrate
Meas. Tech.
ChEMBL_972637 (CHEMBL2410617)
IC50
0.27±n/a nM
Citation
 Czechtizky, WDedio, JDesai, BDixon, KFarrant, EFeng, QMorgan, TParry, DMRamjee, MKSelway, CNSchmidt, TTarver, GJWright, AG Integrated Synthesis and Testing of Substituted Xanthine Based DPP4 Inhibitors: Application to Drug Discovery. ACS Med Chem Lett 4:768-72 (2013)  
Target
Name:
Dipeptidyl peptidase 4
Synonyms:
CD26 DPP IV DPP4_PIG Dipeptidyl peptidase 4 membrane form Dipeptidyl peptidase IV Dipeptidyl peptidase IV soluble form | T-cell activation antigen CD26
Type:
Enzyme
Mol. Mass.:
88235.21
Organism:
Sus scrofa (pig)
Description:
Residue:
766
  
Inhibitor
Name:
BDBM50437403
Synonyms:
CHEMBL2408771
Type:
Small organic molecule
Emp. Form.:
C26H32N6O3
Mol. Mass.:
476.5707
SMILES:
[#6]\[#6](-[#6])=[#6]\[#6]-n1c(nc2n(-[#6])c(=O)n(-[#6]-[#6](=O)-c3ccccc3)c(=O)c12)-[#7]-1-[#6]-[#6]-2-[#6]-[#6]-[#6]-[#7]-[#6]-2-[#6]-1
: