Target
Serine/threonine-protein kinase ATR
Ligand
BDBM50437436
Substrate
Meas. Tech.
ChEMBL_974436 (CHEMBL2412508)
Ki
90±n/a nM
Citation
 Abdel-Magid, AF Inhibitors of ATR Kinase for Treatment of Cancer. ACS Med Chem Lett 4:688-9 (2013)  
Target
Name:
Serine/threonine-protein kinase ATR
Synonyms:
ATR Ataxia telangiectasia and Rad3-related protein (ATR) FRP1 | Serine-protein kinase ATR
Type:
Protein
Mol. Mass.:
301404.58
Organism:
Homo sapiens (Human)
Description:
Q13535
Residue:
2644
  
Inhibitor
Name:
BDBM50437436
Synonyms:
CHEMBL2409216 | US8841450, I-1
Type:
Small organic molecule
Emp. Form.:
C22H22N4O3S
Mol. Mass.:
422.5
SMILES:
CC(C)S(=O)(=O)c1ccc(cc1)-c1cnc(N)c(n1)C1CC(=NO1)c1ccccc1
: